vegetable oil-n
type: LexicalEntry
canonical form: vegetable oil
sense: 07689142-n
part of speech: noun

oil-n
type: LexicalEntry
canonical form: oil
sense: 07689142-n
part of speech: noun

07689142-n
type: LexicalConcept
in scheme: en-word.net
definition: any of a group of liquid edible fats that are obtained from plants
ili: i77272
lexfile: noun.food
part of speech: noun
hypernym: 07687880-n