game-n
type: LexicalEntry
canonical form: game
sense: 07666058-n
part of speech: noun

07666058-n
type: LexicalConcept
in scheme: en-word.net
definition: the flesh of wild animals that is used for food
ili: i77101
lexfile: noun.food
part of speech: noun
hypernym: 07665463-n