bird-n
type: LexicalEntry
canonical form: bird
sense: 07659991-n
part of speech: noun

fowl-n
type: LexicalEntry
canonical form: fowl
sense: 07659991-n
part of speech: noun

07659991-n
type: LexicalConcept
in scheme: en-word.net
definition: the flesh of a bird or fowl (wild or domestic) used as food
ili: i77063
lexfile: noun.food
part of speech: noun
hypernym: 07665463-n
mero part: 01898152-n
mero part: 07663479-n
mero part: 07663876-n
mero part: 07664158-n
mero part: 07664705-n
mero part: 07664951-n
mero part: 07665072-n
mero part: 07666246-n