rock candy-n
type: LexicalEntry
canonical form: rock candy
sense: 07624692-n
part of speech: noun

rock-n
type: LexicalEntry
canonical form: rock
sense: 07624692-n
part of speech: noun

07624692-n
type: LexicalConcept
in scheme: en-word.net
definition: hard bright-colored stick candy (typically flavored with peppermint)
ili: i76804
lexfile: noun.food
part of speech: noun
hypernym: 07612936-n