broth-n
type: LexicalEntry
canonical form: broth
sense: 07600779-n
part of speech: noun

stock-n
type: LexicalEntry
canonical form: stock
sense: 07600779-n
part of speech: noun

07600779-n
type: LexicalConcept
in scheme: en-word.net
definition: liquid in which meat and vegetables are simmered; used as a basis for e.g. soups or sauces
example: she made gravy with a base of beef stock
ili: i76630
lexfile: noun.food
part of speech: noun
hypernym: 07598762-n