fare-n
type: LexicalEntry
canonical form: fare
sense: 07576217-n
part of speech: noun

07576217-n
type: LexicalConcept
in scheme: en-word.net
definition: the food and drink that are regularly served or consumed
ili: i76481
lexfile: noun.food
part of speech: noun
hypernym: 00021445-n