sympathy-n
type: LexicalEntry
canonical form: sympathy
sense: 07568767-n
part of speech: noun

fellow feeling-n
type: LexicalEntry
canonical form: fellow feeling
sense: 07568767-n
part of speech: noun

07568767-n
type: LexicalConcept
in scheme: en-word.net
definition: sharing the feelings of others (especially feelings of sorrow or anguish)
ili: i76455
lexfile: noun.feeling
part of speech: noun
hypernym: 00026390-n