anxiousness-n
type: LexicalEntry
canonical form: anxiousness
sense: 07539999-n
part of speech: noun

disquiet-n
type: LexicalEntry
canonical form: disquiet
sense: 07539999-n
part of speech: noun

07539999-n
type: LexicalConcept
in scheme: en-word.net
definition: a feeling of mild anxiety about possible developments
ili: i76296
lexfile: noun.feeling
part of speech: noun
hypernym: 07539144-n