easiness-n
type: LexicalEntry
canonical form: easiness
sense: 07531213-n
part of speech: noun

relaxation-n
type: LexicalEntry
canonical form: relaxation
sense: 07531213-n
part of speech: noun

07531213-n
type: LexicalConcept
in scheme: en-word.net
definition: a feeling of refreshing tranquility and an absence of tension or worry
example: the easiness we feel when sleeping
ili: i76251
lexfile: noun.feeling
part of speech: noun
hypernym: 07530799-n