expectation-n
type: LexicalEntry
canonical form: expectation
sense: 07526162-n
part of speech: noun

07526162-n
type: LexicalConcept
in scheme: en-word.net
definition: the feeling that something is about to happen
ili: i76220
lexfile: noun.feeling
part of speech: noun
hypernym: 00026390-n