pain-n
type: LexicalEntry
canonical form: pain
sense: 07509503-n
part of speech: noun

painfulness-n
type: LexicalEntry
canonical form: painfulness
sense: 07509503-n
part of speech: noun

07509503-n
type: LexicalConcept
in scheme: en-word.net
definition: emotional distress; a fundamental feeling that people try to avoid
example: the pain of loneliness
ili: i76126
lexfile: noun.feeling
part of speech: noun
hypernym: 00026390-n