infatuation-n
type: LexicalEntry
canonical form: infatuation
sense: 07496224-n
part of speech: noun

07496224-n
type: LexicalConcept
in scheme: en-word.net
definition: a foolish and usually extravagant passion or love or admiration
ili: i76049
lexfile: noun.feeling
part of speech: noun
hypernym: 07496036-n