defeat-n
type: LexicalEntry
canonical form: defeat
sense: 07490504-n
part of speech: noun

licking-n
type: LexicalEntry
canonical form: licking
sense: 07490504-n
part of speech: noun

07490504-n
type: LexicalConcept
in scheme: en-word.net
definition: an unsuccessful ending to a struggle or contest
example: it was a narrow defeat
example: the army's only defeat
example: they suffered a convincing licking
ili: i76016
lexfile: noun.event
part of speech: noun
hypernym: 07306035-n
hypernym: 07332364-n