rubber-n
type: LexicalEntry
canonical form: rubber
sense: 07480405-n
part of speech: noun

07480405-n
type: LexicalConcept
in scheme: en-word.net
definition: a contest consisting of a series of successive matches between the same sides
example: he won three out of five games to take the rubber
lexfile: noun.event
part of speech: noun
hypernym: 07470961-n