circumstance-n
type: LexicalEntry
canonical form: circumstance
sense: 07465938-n
part of speech: noun

07465938-n
type: LexicalConcept
in scheme: en-word.net
definition: formal ceremony about important occasions
example: pomp and circumstance
ili: i75872
lexfile: noun.event
part of speech: noun
hypernym: 07465442-n