celebration-n
type: LexicalEntry
canonical form: celebration
sense: 07465251-n
part of speech: noun

jubilation-n
type: LexicalEntry
canonical form: jubilation
sense: 07465251-n
part of speech: noun

07465251-n
type: LexicalConcept
in scheme: en-word.net
definition: a joyful occasion for special festivities to mark some happy event
ili: i75870
lexfile: noun.event
part of speech: noun
hypernym: 07461861-n