emission-n
type: LexicalEntry
canonical form: emission
sense: 07448468-n
part of speech: noun

07448468-n
type: LexicalConcept
in scheme: en-word.net
definition: the occurrence of a flow of water (as from a pipe)
ili: i75778
lexfile: noun.event
part of speech: noun
hypernym: 07420493-n