fadeout-n
type: LexicalEntry
canonical form: fadeout
sense: 07445969-n
part of speech: noun

07445969-n
type: LexicalConcept
in scheme: en-word.net
definition: a gradual temporary loss of a transmitted signal due to electrical disturbances
ili: i75764
lexfile: noun.event
part of speech: noun
hypernym: 07444811-n