background-n
type: LexicalEntry
canonical form: background
sense: 07445080-n
part of speech: noun

background signal-n
type: LexicalEntry
canonical form: background signal
sense: 07445080-n
part of speech: noun

07445080-n
type: LexicalConcept
in scheme: en-word.net
definition: extraneous signals that can be confused with the phenomenon to be observed or measured
example: they got a bad connection and could hardly hear one another over the background signals
ili: i75759
lexfile: noun.event
part of speech: noun
hypernym: 07444811-n