reversion-n
type: LexicalEntry
canonical form: reversion
sense: 07441173-n
part of speech: noun

07441173-n
type: LexicalConcept
in scheme: en-word.net
definition: (genetics) a return to a normal phenotype (usually resulting from a second mutation)
ili: i75738
lexfile: noun.event
part of speech: noun
domain topic: 06085077-n
hypernym: 07439611-n