crisis-n
type: LexicalEntry
canonical form: crisis
sense: 07432244-n
part of speech: noun

07432244-n
type: LexicalConcept
in scheme: en-word.net
definition: a crucial stage or turning point in the course of something
example: after the crisis the patient either dies or gets better
ili: i75692
lexfile: noun.event
part of speech: noun
hypernym: 07431314-n