transmutation-n
type: LexicalEntry
canonical form: transmutation
sense: 07431041-n
part of speech: noun

07431041-n
type: LexicalConcept
in scheme: en-word.net
definition: (physics) the change of one chemical element into another (as by nuclear decay or radioactive bombardment)
example: the transmutation of base metals into gold proved to be impossible
ili: i75687
lexfile: noun.event
part of speech: noun
domain topic: 06100457-n
hypernym: 07311046-n