reversal-n
type: LexicalEntry
canonical form: reversal
sense: 07425760-n
part of speech: noun

turn around-n
type: LexicalEntry
canonical form: turn around
sense: 07425760-n
part of speech: noun

07425760-n
type: LexicalConcept
in scheme: en-word.net
definition: turning in an opposite direction or position
example: the reversal of the image in the lens
ili: i75657
lexfile: noun.event
part of speech: noun
hypernym: 07366212-n