clack-n
type: LexicalEntry
canonical form: clack
sense: 07394563-n
part of speech: noun

clap-n
type: LexicalEntry
canonical form: clap
sense: 07394563-n
part of speech: noun

07394563-n
type: LexicalConcept
in scheme: en-word.net
definition: a sharp abrupt noise as if two objects hit together; may be repeated
ili: i75477
lexfile: noun.event
part of speech: noun
hypernym: 07402109-n