combining-n
type: LexicalEntry
canonical form: combining
sense: 07388403-n
part of speech: noun

combine-n
type: LexicalEntry
canonical form: combine
sense: 07388403-n
part of speech: noun

07388403-n
type: LexicalConcept
in scheme: en-word.net
definition: an occurrence that results in things being united
ili: i75438
lexfile: noun.event
part of speech: noun
hypernym: 07387877-n