collapse-n
type: LexicalEntry
canonical form: collapse
sense: 07375728-n
part of speech: noun

07375728-n
type: LexicalConcept
in scheme: en-word.net
definition: a natural event caused by something suddenly falling down or caving in
example: the roof is in danger of collapse
example: the collapse of the old star under its own gravity
ili: i75375
lexfile: noun.event
part of speech: noun
hypernym: 07298313-n