wave-n
type: LexicalEntry
canonical form: wave
sense: 07366790-n
part of speech: noun

moving ridge-n
type: LexicalEntry
canonical form: moving ridge
sense: 07366790-n
part of speech: noun

07366790-n
type: LexicalConcept
in scheme: en-word.net
definition: one of a series of ridges that moves across the surface of a liquid (especially across a large body of water)
ili: i75330
lexfile: noun.event
part of speech: noun
hypernym: 07324399-n