sequence-n
type: LexicalEntry
canonical form: sequence
sense: 07356983-n
part of speech: noun

07356983-n
type: LexicalConcept
in scheme: en-word.net
definition: several repetitions of a melodic phrase in different keys
ili: i75275
lexfile: noun.event
part of speech: noun
hypernym: 07356649-n