destiny-n
type: LexicalEntry
canonical form: destiny
sense: 07344607-n
part of speech: noun

fate-n
type: LexicalEntry
canonical form: fate
sense: 07344607-n
part of speech: noun

07344607-n
type: LexicalConcept
in scheme: en-word.net
definition: an event (or a course of events) that will inevitably happen in the future
ili: i75212
lexfile: noun.event
part of speech: noun
hypernym: 07298313-n