creation-n
type: LexicalEntry
canonical form: creation
sense: 07343542-n
part of speech: noun

conception-n
type: LexicalEntry
canonical form: conception
sense: 07343542-n
part of speech: noun

07343542-n
type: LexicalConcept
in scheme: en-word.net
definition: the event that occurred at the beginning of something
example: from its creation the plan was doomed to failure
ili: i75206
lexfile: noun.event
part of speech: noun
hypernym: 07305628-n