factor-n
type: LexicalEntry
canonical form: factor
sense: 07342405-n
part of speech: noun

07342405-n
type: LexicalConcept
in scheme: en-word.net
definition: anything that contributes causally to a result
example: a number of factors determined the outcome
ili: i75200
lexfile: noun.event
part of speech: noun
hypernym: 07341157-n