stall-n
type: LexicalEntry
canonical form: stall
sense: 07333424-n
part of speech: noun

07333424-n
type: LexicalConcept
in scheme: en-word.net
definition: a malfunction in the flight of an aircraft in which there is a sudden loss of lift that results in a downward plunge
example: the plane went into a stall and I couldn't control it
ili: i75150
lexfile: noun.event
part of speech: noun
hypernym: 07333076-n