injury-n
type: LexicalEntry
canonical form: injury
sense: 07328236-n
part of speech: noun

accidental injury-n
type: LexicalEntry
canonical form: accidental injury
sense: 07328236-n
part of speech: noun

07328236-n
type: LexicalConcept
in scheme: en-word.net
definition: an accident that results in physical damage or hurt
ili: i75124
lexfile: noun.event
part of speech: noun
hypernym: 07315954-n