convulsion-n
type: LexicalEntry
canonical form: convulsion
sense: 07320056-n
part of speech: noun

07320056-n
type: LexicalConcept
in scheme: en-word.net
definition: a physical disturbance such as an earthquake or upheaval
ili: i75082
lexfile: noun.event
part of speech: noun
hypernym: 07303737-n