blip-n
type: LexicalEntry
canonical form: blip
sense: 07313821-n
part of speech: noun

07313821-n
type: LexicalConcept
in scheme: en-word.net
definition: a sudden minor shock or meaningless interruption
example: the market had one bad blip today
example: you can't react to the day-to-day blips
example: renewed jitters in the wake of a blip in retail sales
ili: i75047
lexfile: noun.event
part of speech: noun
hypernym: 07313600-n