break-n
type: LexicalEntry
canonical form: break
sense: 07312251-n
part of speech: noun

07312251-n
type: LexicalConcept
in scheme: en-word.net
definition: an abrupt change in the tone or register of the voice (as at puberty or due to emotion)
example: then there was a break in her voice
ili: i75038
lexfile: noun.event
part of speech: noun
hypernym: 07311046-n