beginning-n
type: LexicalEntry
canonical form: beginning
sense: 07305628-n
part of speech: noun

07305628-n
type: LexicalConcept
in scheme: en-word.net
definition: the event consisting of the start of something
example: the beginning of the war
ili: i75005
lexfile: noun.event
part of speech: noun
hypernym: 07298313-n