good time-n
type: LexicalEntry
canonical form: good time
sense: 07301993-n
part of speech: noun

blast-n
type: LexicalEntry
canonical form: blast
sense: 07301993-n
part of speech: noun

07301993-n
type: LexicalConcept
in scheme: en-word.net
definition: a highly pleasurable or exciting experience
example: we had a good time at the party
example: celebrating after the game was a blast
ili: i74984
lexfile: noun.event
part of speech: noun
hypernym: 07300108-n