transformation-n
type: LexicalEntry
canonical form: transformation
sense: 07275000-n
part of speech: noun

07275000-n
type: LexicalConcept
in scheme: en-word.net
definition: a rule describing the conversion of one syntactic structure into another related syntactic structure
ili: i74825
lexfile: noun.communication
part of speech: noun
hypernym: 07274843-n