fostering-n
type: LexicalEntry
canonical form: fostering
sense: 07266874-n
part of speech: noun

fosterage-n
type: LexicalEntry
canonical form: fosterage
sense: 07266874-n
part of speech: noun

07266874-n
type: LexicalConcept
in scheme: en-word.net
definition: encouragement; aiding the development of something
ili: i74783
lexfile: noun.communication
part of speech: noun
hypernym: 06704187-n