dare-n
type: LexicalEntry
canonical form: dare
sense: 07246192-n
part of speech: noun

daring-n
type: LexicalEntry
canonical form: daring
sense: 07246192-n
part of speech: noun

07246192-n
type: LexicalConcept
in scheme: en-word.net
definition: a challenge to do something dangerous or foolhardy
example: he could never refuse a dare
ili: i74667
lexfile: noun.communication
part of speech: noun
hypernym: 07245954-n