indication-n
type: LexicalEntry
canonical form: indication
sense: 07245708-n
part of speech: noun

denotation-n
type: LexicalEntry
canonical form: denotation
sense: 07245708-n
part of speech: noun

07245708-n
type: LexicalConcept
in scheme: en-word.net
definition: the act of indicating or pointing out by name
ili: i74664
lexfile: noun.communication
part of speech: noun
hypernym: 07245162-n