assurance-n
type: LexicalEntry
canonical form: assurance
sense: 07242066-n
part of speech: noun

07242066-n
type: LexicalConcept
in scheme: en-word.net
definition: a statement intended to inspire confidence
example: the President's assurances were not respected
ili: i74643
lexfile: noun.communication
part of speech: noun
hypernym: 06735202-n