promise-n
type: LexicalEntry
canonical form: promise
sense: 07241205-n
part of speech: noun

07241205-n
type: LexicalConcept
in scheme: en-word.net
definition: a verbal commitment by one person to another agreeing to do (or not to do) something in the future
ili: i74638
lexfile: noun.communication
part of speech: noun
hypernym: 07175534-n
hypernym: 06697128-n