debut-n
type: LexicalEntry
canonical form: debut
sense: 07232239-n
part of speech: noun

07232239-n
type: LexicalConcept
in scheme: en-word.net
definition: the presentation of a debutante in society
ili: i74588
lexfile: noun.communication
part of speech: noun
hypernym: 07232009-n