display-n
type: LexicalEntry
canonical form: display
sense: 07228377-n
part of speech: noun

07228377-n
type: LexicalConcept
in scheme: en-word.net
definition: behavior that makes your feelings public
example: a display of emotion
ili: i74566
lexfile: noun.communication
part of speech: noun
hypernym: 07228055-n