bar examination-n
type: LexicalEntry
canonical form: bar examination
sense: 07212197-n
part of speech: noun

bar exam-n
type: LexicalEntry
canonical form: bar exam
sense: 07212197-n
part of speech: noun

07212197-n
type: LexicalConcept
in scheme: en-word.net
definition: an examination conducted at regular intervals to determine whether a candidate is qualified to practice law in a given jurisdiction
example: applicants may qualify to take the New York bar examination by graduating from an approved law school
example: he passed the bar exam on his third try
ili: i74477
lexfile: noun.communication
part of speech: noun
hypernym: 07211681-n