challenge-n
type: LexicalEntry
canonical form: challenge
sense: 07208065-n
part of speech: noun

07208065-n
type: LexicalConcept
in scheme: en-word.net
definition: questioning a statement and demanding an explanation
example: his challenge of the assumption that Japan is still our enemy
ili: i74459
lexfile: noun.communication
part of speech: noun
hypernym: 07207844-n