intercession-n
type: LexicalEntry
canonical form: intercession
sense: 07204848-n
part of speech: noun

07204848-n
type: LexicalConcept
in scheme: en-word.net
definition: a prayer to God on behalf of another person
ili: i74439
lexfile: noun.communication
part of speech: noun
hypernym: 07203790-n