suit-n
type: LexicalEntry
canonical form: suit
sense: 07203230-n
part of speech: noun

07203230-n
type: LexicalConcept
in scheme: en-word.net
definition: a petition or appeal made to a person of superior status or rank
ili: i74429
lexfile: noun.communication
part of speech: noun
hypernym: 07201488-n